Deviant Login Shop  Join deviantART for FREE Take the Tour
×



Details

Submitted on
April 26, 2012
Link
Thumb

Stats

Views
6,195 (1 today)
Favourites
10 (who?)
Comments
16
×
1. Download from launchpad.net/~sausageandeggs/… - covergloobus_1.7-0~361~precise1.tar.gz
2. Unpack and go to recipe-1.7
3. In terminal:
     sudo apt-get install automake
     ./autogen.sh
     make
     sudo make install
4. If not work, install python-xlib and python-support
  • Playing: Lords of Acid - The Power Is Mine
  • Drinking: Coffee
Add a Comment:
 
:iconclaudette86:
claudette86 Jan 7, 2013  Hobbyist Artist
Thanks, it works on Xubuntu 12.04 :)
But for Xubuntu 12.10? Any chance to use it?
Reply
:iconhybrld:
Thank you, but you should add to get automake in those instructions to make it more clear for newer linux users ;)
Reply
:iconpurvaldur:
purvaldur Nov 30, 2012  Hobbyist Digital Artist
I have a problem with the ''sudo make install''

../../py-compile: Missing argument to --destdir.
make[3]: *** [install-lyricsPYTHON] Error 1
make[3]: Leaving directory `/home/thorvald/covergloobus-1.6/src/lyrics'
make[2]: *** [install-am] Error 2
make[2]: Leaving directory `/home/thorvald/covergloobus-1.6/src/lyrics'
make[1]: *** [install-recursive] Error 1
make[1]: Leaving directory `/home/thorvald/covergloobus-1.6/src'
make: *** [install-recursive] Error 1
Reply
:iconpaz-1:
Thank you! worked for me! :D
Reply
:iconmoeenn:
moeenn Sep 28, 2012  Student Interface Designer
Worked like a charm, I can't thank you enough
Reply
:iconteique:
teique Aug 10, 2012  Hobbyist Digital Artist
can someone use checkinstall to create a covergloobus package for ubuntu 12.04? I cant compile it for some reason brz throws an error, and other compile problems.. :(
Reply
:icondgoeduardo:
It works, thank you very much
Reply
:iconiamfuss:
no problem)
Reply
:icondgoeduardo:
Really?, Ill try this nao :D
Reply
:iconpipe1984:
Hello, I have a problem. I have downloaded covergloobus_1.7-0~361~precise1.tar.gz, unpack and enter dir recipe but when i execute sh autogen.sh the terminal say:


autogen.sh: 3: autogen.sh: aclocal: not found
autogen.sh: 4: autogen.sh: autoconf: not found
autogen.sh: 5: autogen.sh: automake: not found
Running configure with arguments
autogen.sh: 7: autogen.sh: ./configure: not found

What's happend? What i can do?
Thanks
Reply
Add a Comment: